News

Wsws3227e Error

RECOMMENDED: If you have Windows errors then we strongly recommend that you download and run this (Windows) Repair Tool.

You notice java2wsdl throws WSWS3227E. The root cause is due to WSWS3034E Overall, these messages indicate a mismatch or conflict between the definition of a.

IBM WSWS3227E: Error: Exception: java.io.IOException. – You notice an exception occurs when a web service provider running on WebSphere Application Server receives a SOAP request. The stack trace logged to the application.

Apr 7, 2010. WebServicesServlet doPost WSWS3227E: Error: Exception: WebServicesFault faultCode: {http://schemas.xmlsoap.org/soap/envelope/}Server.generalExcepti on faultString: cannot retrieve com.ibm.ws.sib.webservices.multiprotocol. PortConfigurationExcept ion: com.ibm.ws.sib.mfp.sdo.resource.

Error Archivo Rar Hola amigos de youtube aquí SproilexHD,En este tutorial les enseñare a como reparar un archivo winrar que este dañado. Si no tienes Winrar aquí esta el. How To Fix Printer Spooler Error In Windows Vista Start/Stop Print Spooler service in Windows 7 from Services, Regedit or CMD. From General tab you can Start/Stop and change

I have a jax-rpc web service. 0000002b WebServicesSe E com.ibm.ws.webservices.engine.transport.http.WebServicesServlet doPost WSWS3227E: Error:.

If the Content-Type defines the type parameter such that it includes both the type and the charset, then the following error may occur: [7/13/09 14:57:35:703 CDT] 00000038 InternalExcep E com.ibm.ws.webservices.engine.InternalException < init> WSWS3227E: Error: Exception: java.lang.Exception: WSWS3710E: Internal.

A customer migrating a JAX-RPC application from WebSphere Application Server V5.1 to WebSphere Application Server V6.1 encountered the following error when running the application: WSWS3227E: Error: Exception: WebServicesFault faultCode: {http://schemas.xmlsoap.org/soap/envelope/}Client faultString:.

IBM WebSphere Application Server provides periodic fixes for the base and Network Deployment editions of release V7.0. The following is a complete listing of fixes.

Call EJB method from web services project – Stack Overflow – Jun 4, 2013. The error message seems similar to this: JAX-WS server-side SOAPHandler that returns fault gets "Internal Error" on WebSphere v8. According to IBM: When webservices.unify.faults is set to "true", the runtime exception thrown by the application code is unified, and the client will receive a SOAP fault.

Dec 12, 2012. IOException: InputStream closed may occur. Here is the stack trace in the server log — [4/3/12 13:22:56:031 CEST] 00000045 InternalExcep E com.ibm.ws. webservices.engine.InternalException <init> WSWS3227E: Error: Exception: java.io.IOException: InputStream closed at com.ibm.ws.sca.internal.jms.util.

WebServicesServlet doPost WSWS3227E: Error: Exception: WebServicesFault faultCode: {http://schemas.xmlsoap.org/soap/envelope/}Server.generalException faultString: java.lang.NullPointerException Message being parsed: faultActor: null faultDetail: java.lang.NullPointerException Message being.

Internet Explorer Runtime Error Pure Virtual Function Call At a White House press conference today, President Trump accused former FBI director James Comey of perjuring himself before the US Senate—a very serious charge—and further advanced the ridiculous charade that he can prove. Want to bump this with information that I can reproduce this error "Runtime error – R6025 – Pure virtual function call.
Windows Xp Error Invalid Boot Ini Information Week has an article on fixing a non-booting Windows install. invalid, missing, or corrupt startup information was preventing normal booting. This method should work with these errors: "Missing or corrupt. Installing Windows XP on the Asus EEE pc using a single USB flash drive. Please note this tutorial works on all computers not just

RECOMMENDED: Click here to fix Windows errors and improve system performance

News

Error Archivo Rar

Corregir / Recuperar archivos dañados Error CRC con Winrar

RECOMMENDED: If you have Windows errors then we strongly recommend that you download and run this (Windows) Repair Tool.

Hola amigos de youtube aquí SproilexHD,En este tutorial les enseñare a como reparar un archivo winrar que este dañado. Si no tienes Winrar aquí esta el.

How To Fix Printer Spooler Error In Windows Vista Start/Stop Print Spooler service in Windows 7 from Services, Regedit or CMD. From General tab you can Start/Stop and change the Startup type of Print Spooler. To finish press ok button and close. Warning Serious problems might occur if you modify the registry incorrectly by using Registry Editor or by using another. Jun 26, 2017

Aug 22, 2010  · como ven es sencillo esto tambien funciona en imagenes, videos, etc Al reproducir el archivo en caso de la musica y videos el reproductor de windows les.

Internet Explorer Runtime Error Pure Virtual Function Call At a White House press conference today, President Trump accused former FBI director James Comey of perjuring himself before the US Senate—a very serious charge—and further advanced the ridiculous charade that he can prove. Want to bump this with information that I can reproduce this error "Runtime error – R6025 – Pure virtual function call.

Se utiliza principalmente para transferir / descargar archivos de gran número y para conservar el espacio de almacenamiento en el sistema. Sin embargo, en paralelo a otros archivos, incluso los archivos RAR se vuelven erróneos o se corrompen debido a numerosas razones y el problema más común es el error CRC.

Convertidor de formato de archivo comprimido, extensión : 7z zip cab rar arj lzh chm gzip bzip2 z tar cpio iso msi wim nsis rpm deb

31 Ago 2009. Imagine que un archivo es una hoja de papel donde tiene escritos unos datos, si moja esa hoja la tinta se disuelve y es imposible leer ese texto, si rompe esa hoja y le falta un trozo tampoco podrá leer el texto entero. Cuando WinRAR le dice que un archivo esta dañado es porque ha detectado un error de.

Get your hands on the latest release of SAP Application Server ABAP and SAP Business Warehouse, learn more about their latest capabilities, and test-drive the SAP.

Solucion a archivos dañados corruptos error crc en winrar. – si no les sale, de preferencia, borrar lo que descomprimieron, y el archivo winrar o partes del winrar, moverlo a otro lado, y de ahi descomprimir asi como.

Error Installing Crystal Reports 11 Symptom. Error occurs when installing Crystal Reports. During Crystal Reports installation it fails with the error: "Failed to update cache for execution. Program will exit." Install-error.png. Environment. SAP Crystal Reports 2011; SAP Crystal Reports 2013; SAP Crystal Reports 2016. Reproducing the Issue. SAP Crystal Reports Viewer 2011 – Release Notes About these Release Notes Intended

Hola amigos, ayer comprimí algunos archivos de vídeo usando WinRAR en mi portátil de Windows 7. Pero hoy cuando intenté extraer esos archivos usando la misma aplicación WinRAR dice "leer error en el archivo" y dice Reintentar, OK. Cuando hago clic en OK Botón de nuevo dice "error de lectura en el archivo",

3 soluciones para el error de CRC en archivos rar – Soluciones del error de CRC al descomprimir archivos rar. Reparar un rar dañado automáticamente para conseguir abrirlo. Qué es el CRC.

Todo dependerá del nivel de daño del archivo. El archivo seleccionado se guarda en el disco. Recovery Toolbox for RAR ayuda a corregir los problemas siguientes: El archivo presenta un formato desconocido o está dañado. El encabezado del archivo.rar está dañado. Error de CRC en el nombre de archivo. El archivo.

convert anything to anything – more than 200 different audio, video, document, ebook, archive, image, spreadsheet and presentation formats supported.

29 Jul 2017. El error de CRC ocurre con cierta frecuencia al intentar descomprimir archivos rar. Puede pasar cuando el rar es un solo archivo. También si está formado por varias partes cuando una o más de ellas tengan algún problema. Sabrás que es un fallo del CRC y no de otro tipo porque al descomprimir te sale.

6 Jul 2013. Ahora, vamos a ESCRIBIR, lo siguiente, para descomprimir con la contraseña sin comillas "www.compucalitv.com" 2-"Me sale error y me dice que el archivo esta dañado", Este también es muy común, esto es cuando el archivo no se descarga bien, eso quiere decir que lo detecta el winrar como dañado y.

RECOMMENDED: Click here to fix Windows errors and improve system performance

News

Internet Explorer Runtime Error Pure Virtual Function Call

Fix Runtime Error R6025 on Windows 7 (Complete Guide)

RECOMMENDED: If you have Windows errors then we strongly recommend that you download and run this (Windows) Repair Tool.

At a White House press conference today, President Trump accused former FBI director James Comey of perjuring himself before the US Senate—a very serious charge—and further advanced the ridiculous charade that he can prove.

Want to bump this with information that I can reproduce this error "Runtime error – R6025 – Pure virtual function call. Internet Explorer on. <Runtime Error:.

2012年1月5日. runtime error program:CProgram FilesInternet Exploreriexplore.exe. R6025 – pure virtual function call. 和我遇见的一样的,开始也不好玩!现在可以了!我来 告诉你:你游戏和XP系统有冲突造成的,如果你不会调试也没关系,重新安装下试试,这 是文件运行错误,不行重新下个别的试试 下面是转载的~你可以参考下

About Electron. Electron is an open source library developed by GitHub for building cross-platform desktop applications with HTML, CSS, and JavaScript.

When i close internet explorer i sometimes get a message: runtime error. program C:\programfiles\internetexplorer\explor.exe R6025 What should I do to fix.

On today’s episode of the Reason Podcast, Nick Gillespie, Katherine Mangu-Ward, Peter Suderman, and Matt Welch discuss the Rep. John Conyers (D-Mich.) sex scandal, last week’s repeal of net neutrality, and Reason’s upcoming.

"Virtual User Container Error Runtime: 117 – External Function: can not load external function.""? "Warning:. How can I resolve "BrowserEngine: 32 – Internet Explorer request failed without 'Visible client'" error? How can I. How can I resolve the error "RUNERR: 37 – Run stack error during BDL function call" · How can I.

Runtime Error in Internet Explorer. – pure virtual function call. Fix Runtime Errors in Internet Explorer,

I only remember one practical writing lesson from my three years as an English major: Whenever you can, put the best bits at the end of the sentence. Put the next-best bits at the beginning, and put the rest in the middle. This trick.

Jul 10, 2017  · Security. Let’s face it. Software has holes. And hackers love to exploit them. New vulnerabilities appear almost daily. If you have software – we all do -.

0) { // glob returns files in alphabetical order by default, so we only need to invert resulting list to have it // sorted by major release in descending order. Then.

How To Fix Printer Spooler Error In Windows Vista Start/Stop Print Spooler service in Windows 7 from Services, Regedit or CMD. From General tab you can Start/Stop and change the Startup type of Print Spooler. To finish press ok button and close. Warning Serious problems might occur if you modify the registry incorrectly by using Registry Editor or by using another. Jun 26, 2017

Jan 12, 2006. Runtime error " C:.saplogon.exe "R6025 – pure virtual function call" and once he clicks 'ok', SAP automatically logs off, and he has to sign on again.he runs reports all day. I added this solution, because today I had the same problem with the 720 Final Release + IE8 and there is no solution for this topic.

runtime error! program:c:\program files – Microsoft Community – runtime error! program:c:\program files (x86)internet explorer\iexplore.exe R6025 pure virtual function call

Search Fix Runtime Error Free.

A B C D E F G H I J K L M N O P Q R S T U V W X Y Z Å Ä Ö =-2D – 2-Dimensional 3ACC – 3A Central Control 3D – 3-Dimensional 3M – Minnesota Mining and Manufacturing

RECOMMENDED: Click here to fix Windows errors and improve system performance

News

Error Installing Crystal Reports 11

Crystal Reports Installation

RECOMMENDED: If you have Windows errors then we strongly recommend that you download and run this (Windows) Repair Tool.

Symptom. Error occurs when installing Crystal Reports. During Crystal Reports installation it fails with the error: "Failed to update cache for execution. Program will exit." Install-error.png. Environment. SAP Crystal Reports 2011; SAP Crystal Reports 2013; SAP Crystal Reports 2016. Reproducing the Issue.

SAP Crystal Reports Viewer 2011 – Release Notes About these Release Notes Intended for anyone involved in installing, configuring, administering, or supporting users.

Nature – Although the program uses only 2D profile fitting, it can readily integrate data collected in the ‘fine phi-slicing’ mode (in which the rotation angle per image is less than the crystal mosaic. according to common installation methods.

Talking about the installation of a new dealership management system elicits. Thompson’s store would close at 7 p.m., but staffers would be there as late as 11, learning the ins and outs of the new setup. Thompson said just about anyone.

Many issues with the installation. I am getting a fatal error during the setup process that stops the installation, also it is showing under the prerequisite the.

Aug 14, 2016. Overview. While installing the Crystal Reports v11 Runtime for the Reports application, you receive the following error message: Error 1904. Module C:.dll failed to register.

Hi there! I am trying to install crystal reports for visual studio 2010 having.NET framework 4. I go to the website. http://www.sdn.sap.com/irj/sdn.

. install crystal report on win 7 Deployment Machine it gives me this error. " Error 1904. Module c:Program FilesSAP BusinessObjectsCrystal Reports for.NET Framework 4.0CommonSAP BusinessObjects Enterprise XI 4.0win32_x86 COMMONOBJMODEL.dll failed to register. HRESULT -2147023898.

The following error keeps occurring when I try to install our Crystal Reports XI. We are actually getting this error on a couple machines, and Iu2019ve tried all of.

Error C3262 Invalid Array Indexing WASHINGTON, Feb. 28 – The State Department on Monday detailed an array of human rights abuses last year by the Iraqi government, including torture, rape and illegal detentions by police officers and functionaries of the interim. Nov 18, 2009  · unable to use a 2D array. Visual Studio Languages , Windows Desktop Development > Visual C++.

The U.S. Global Change Research Program Climate Science Special Report was recently published, and its conclusions are crystal clear. such as CO2. There.

Ireland – Jean had taken redundancy from Waterford Crystal and had also sued Waterford. the fact that the obstetrician had admitted there was an error,” says Thomas. “Cantillons’ independent reports found that there was an error. We knew.

Feb 8, 2012. Summary. When Installing Crystal Reports Manually some people get the following error: Error 1904. Applies To. Manually installing Crystal reports on 64x systems. Resolution. The resolution to this problem can be found at the following url:.

Jul 7, 2014. more by this author · SAP Crystal Reports · error1935 · share 0 · share 0 · tweet · share 0. Follow. One of my customer met a problem. Error 1935. An error occurred during the installation of assembly component.{………….}. HRESULT: 0x800736FD. A3YT9~JN)T{]J3]_9]2ORMX.jpg. This is caused by ArcGIS.

Change MinRole in SharePoint 2016: Server roles are selected during the installation of SharePoint 2016 or when you join a server to your farm. Based on the Server.

Oct 21, 2013. MSI (s) (F4:10) [11:39:34:410]: Product: SAP Crystal Reports runtime engine for. NET Framework (64-bit) — Error 1935. An error occurred during the installation of assembly component {844EFBA7-1C24-93B2-A01F-C8B3B9A1E18E}. HRESULT: 0x80073715. assembly interface: IAssemblyCacheItem,

Diamondback moths may be a mere half-inch in length, but their voracious appetite for Brussels sprouts, kale and cauliflower make them a major pain for farmers. This week, the U.S. Department of Agriculture approved a potential.

There are no reports of injuries, according to the city. Paramedics were called to the scene but have since left. Workers were nonetheless shaken and visibly upset over the incident. Workers told CBC. installing rebar at Parliament.

1998563 – Error 1713 when installing Crystal Reports XI (11.0. – Installing Crystal Reports XO (11.0) on Windows Server 2012. During the install the following error is thrown: "Error 1713. Crystal Reports cannot install one of its.

RECOMMENDED: Click here to fix Windows errors and improve system performance

News

How To Fix Printer Spooler Error In Windows Vista

How to fix Print Spooler error

RECOMMENDED: If you have Windows errors then we strongly recommend that you download and run this (Windows) Repair Tool.

Start/Stop Print Spooler service in Windows 7 from Services, Regedit or CMD. From General tab you can Start/Stop and change the Startup type of Print Spooler. To finish press ok button and close. Warning Serious problems might occur if you modify the registry incorrectly by using Registry Editor or by using another.

Jun 26, 2017  · How to Fix a Print Spooler. The print spooler helps your Windows computer interact with the printer, and orders the print jobs in your queue. If you see any error.

At the end of July, two compatibility, performance and reliability fix packs. Microsoft Windows XP to Windows Vista and then restart the computer. ■ The Printer Spooler service stops unexpectedly. ■ You receive a "Stop 0x0000009F".

I keep getting error messages about my “spooler” when I try to print documents from my Windows Vista-operated computer. What does this mean, and what can I do to fix it? A. right-click on Printer Spooler and select Properties.

Free fix for print spooler. How to fix Print spooler not running error ?. Local computer Printer Spooler service crash in windows vista, Printer spooler fix,

Dec 2, 2008. print-spooler. I never understood why Windows won't allow me to remove a hanging print job. I understand that the operating system has to wait for the confirmation from the printer. But if the printer also hangs, the print job is stuck in the queue. In my opinion, this is a bug. It is an old Windows XP problem.

How to Fix a Print Spooler. The print spooler helps your Windows computer interact with the printer, and orders the print jobs in your queue. If you see any error.

You will solve this 'Spooler SubSystem App stopped working and was closed' problem. Trust me; others have already led the way and solved your problem. My difficulty is that there are is not one, but a number of different solutions. The two principle.

Using HP Diagnostic Tools for HP Printers in Windows – HP Support – HP Printers – Using HP Diagnostic Tools for HP Printers in Windows. This document applies to HP printers supported in Windows 10, Windows 8, Windows 7, Windows Vista, and Windows XP. Free tools to help you maintain your HP printer or fix common printing and scanning problems in Windows.

Dec 11, 2010. In this article, I'm going to go through the steps I followed in order to get my printer working again. The solution may help you if you're having any of these types of issues: You get the “Printer Spooler Service Terminated Unexpectedly” error; You find that the Printer and Faxes window is empty and there are.

Fix printer problems Email. If you're using Windows 8.1 or Windows RT 8.1, additional printer support and drivers are available through Windows Update.

Microsoft Updates Fix 11 Vulnerabilities in Windows, Office – Several of these are serious, but there are important mitigating factors on them, and users of the most recent products (especially Windows 7 and Office 2010) are more lightly-affected. The four critical bugs: MS10-061: Vulnerability in.

How to Fix 0x000006ba Printer Spooler Errors Windows operating system misconfiguration is the main cause of 0x000006ba Printer Spooler error codes Therefore, we

Fix printer problems. If you're unable to print or connect to your printer in Windows 10, double-tap (or double-click) Print Spooler.

Microsoft Windows – Untick Information, then click OK to leave all warnings and errors listed. switching the printer off for a few minutes, try the following. Press the Windows key and [R], type "services.msc" and press [Enter]. Right-click Print Spooler, and.

Nov 20, 2017  · Fix printer problems. If you’re unable to print or connect to your printer in Windows 10, double-tap (or double-click) Print Spooler.

Error Installing Crystal Reports 11 Symptom. Error occurs when installing Crystal Reports. During Crystal Reports installation it fails with the error: "Failed to update cache for execution. Program will exit." Install-error.png. Environment. SAP Crystal Reports 2011; SAP Crystal Reports 2013; SAP Crystal Reports 2016. Reproducing the Issue. SAP Crystal Reports Viewer 2011 – Release Notes About these Release Notes Intended

I purchased a new canon printer because I couldn't get my lexmark to work. Printing problems and printing errors. How to Fix Windows Vista Print Spooler not.

How to fix print spooler error 1053?. solve print spooler 1053 windows 7, print spooler error 1053. Printer spooler error 1053 fix for win xp, win 7, windows vista

RECOMMENDED: Click here to fix Windows errors and improve system performance

News

Hp 4650 Error Message Unable To Store Job At Printer

Checking the HP Printer Status When a Printer Offline Message Displays in Windows

RECOMMENDED: If you have Windows errors then we strongly recommend that you download and run this (Windows) Repair Tool.

View and Download HP 4650dn manual online. Hewlett-Packard Color LaserJet Use. 4650dn Printer pdf manual download.

Ibm 3362 Transport Error Proceedings of SPIE, 3362, 322–5. IBM Journal of Research and Development , 17, 525. [Bennett, 1988] Bennett, C.H. (1988). Notes on the History of Reversible Computation. IBM Journal of Research and Development, 32, 16–23. [Bennett. Systems – Possible Future High-Capacity Transport Implementations. Paustian Transport Service is in the Local Trucking, Without Storage business. View competitors,

Shop Office Products.Find everything for the office. From address books to desk lamps.

HP Laserjet 4650 problem. Now I can't print multiple copies of a document.only 1 at a time. I get an error message: Unable to store job at printer.

Есть такой принтер. При отправке на печать больше одной страницы распечатывает первую страницу, а вместо следующих выдаёт. Error: Unable to store job at printer. Reason: Insufficient disk space for this job. Solution: Delete some files from the disk before resending this job. Винчестера на аппарате нету.

Amazon.com: Canon PIXMA MG3620 Wireless All-In-One Color Inkjet Printer with Mobile and Tablet Printing, Black: Electronics

Amazon.com: HP ENVY Photo 7855 All in One Photo Printer with Wireless Printing, Instant Ink ready: Electronics

Call Owner Ken Nagele Today for the Answers to Your Copier, Fax or Printer Questions. We’ll Help You Fix Your Machine Over the Phone for FREE!

While it might be easy enough to buy a new printer for under $50, you might have spent enough on your last one, and be unable. jobs. To ensure it is working, click Maintenance and select Print Test Page. Connecting To Your.

hp 2420 prints a ''job storage status page'' after each print job Error: Unable to store job at printer Reason: – HP LaserJet 2420 Printer question.

Error Zlib-headers And/or Libs Where Not Found While traditional economics assumes that people are rational actors, Thaler. Ibm 3362 Transport Error Proceedings of SPIE, 3362, 322–5. IBM Journal of Research and Development , 17, 525. [Bennett, 1988] Bennett, C.H. (1988). Notes on the History of Reversible Computation. IBM Journal of Research and Development, 32, 16–23. [Bennett. Systems – Possible Future High-Capacity Transport

"Unable to Store Job at Printer" Laser Printer Message – The 'Unable to Store Job' Laser Printer Message. HP LASERJET RESOURCES. Unable To Store Job At Printer. you will get an error message.

Slssqlmaint Failed Sqlstate Hy000 Error 50000 Error 500 Blackberry 9900 Canadian wireless voice and Internet provider. My blackberry wont turn on what so ever so i cant exactly do a OS upgrade i have done everything. how to solve blackberr bold 9900 app error? Was this answer. Error During Cryptacquirecontext For A New Key Applying the latest technologies in this area

Some models hit store shelves in the U.S. with a beefier battery that lasted an even more impressive 8 hours, 34 minutes. This latest netbook from Acer (weight: 2.9 pounds) earned a number three spot in our chart. In our tests, the.

I only remember one practical writing lesson from my three years as an English major: Whenever you can, put the best bits at the end of the sentence. Put the next-best bits at the beginning, and put the rest in the middle. This trick works.

By creating a queue, a way to watch jobs as they run, and adding in some solid compatibility you essentially turn your $3,000 Makerbot into a $150 HP – and that. finally brings the error message “PC LOAD LETTER” to a 3D printer.

HP Color LaserJet 4600, 4650, 5500, and 5550 Series Printers – Unable to Store Job at Printer. ISSUE: When multiple copies are sent to the printer using the PCL 6 driver (using Microsoft® Windows XP or 2000), the printer will print out one copy, then print a Job Storage Status page with the following information: Unable to.

HP J6054B 40gb Eio Hard Drive Disk. MFG Part Number: J6054B Condition: Refurbished MFG:HP. This HP J6054B is Genuine and works with the HP 4100, HP 4300, HP 4600, HP 5500, HP 9000 Printer series. Parts are thoroughly tested, inspected for damage & defects and guaranteed 100% fully functional. $155.00.

HP Color LaserJet 5550 Printers – When Printing Multiple Copies, Message " unable to store job" Is Displayed On The Control Panel OR printed on Job Storage Status Page. Issue. When printing multiple copies, an error message page will print reading unable to store job. OR. When multiple copies are sent to the printer.

Mar 19, 2007. P.S. We have another 4650 in the same building and that prints multiple items from Indesign fine??? Respond to this. 2. I just got a new computer running Vista Business. Now I can't print multiple copies of a document.only 1 at a time. I get an error message: Unable to store job at printer. Printer not.

HP OfficeJet Pro 6978 All-in-One Printer | Quill.com – See pricing info, deals and product reviews for HP® OfficeJet Pro 6978 Wireless Multifunction Color Inkjet Printer at Quill.com. Order online today and get fast.

Need To – We’ve all worried about artificial intelligence reaching a point in which its cognitive ability is so far beyond ours that it turns against us. But what if we just turned the AI into a spineless weenie that longs for our approval? Researchers are.

RECOMMENDED: Click here to fix Windows errors and improve system performance

News

Error Zlib-headers And/or Libs Where Not Found

C++ Qt 99 - Static Library

RECOMMENDED: If you have Windows errors then we strongly recommend that you download and run this (Windows) Repair Tool.

While traditional economics assumes that people are rational actors, Thaler.

Ibm 3362 Transport Error Proceedings of SPIE, 3362, 322–5. IBM Journal of Research and Development , 17, 525. [Bennett, 1988] Bennett, C.H. (1988). Notes on the History of Reversible Computation. IBM Journal of Research and Development, 32, 16–23. [Bennett. Systems – Possible Future High-Capacity Transport Implementations. Paustian Transport Service is in the Local Trucking, Without Storage business. View competitors,

Fortinet – For this, Oletools’s RTFObj by Decalage can be used: C:Python27Libsite.

Apr 2, 2012. configure: error: pcre-config not found, install the pcre-devel package or build with –without-pcre. To solve the problem, type the following command # yum install pcre pcre-devel. configure: error: zlib-headers and/or libs where not found, install them or build with –without-zlib. To solve the problem,

ESPN College Hoops 2K5 is my favorite hoops game of the year for its atmosphere. The crowds are often bigger, rowdier, and full of far more spirit than what’s found in the pros. Once again College Hoops comes through with an.

. error: Package requirements (zlib) were not. ubuntu 12.04 install fontforge No package 'zlib' found. variables ZLIB_CFLAGS and ZLIB_LIBS to avoid the need.

Slssqlmaint Failed Sqlstate Hy000 Error 50000 Error 500 Blackberry 9900 Canadian wireless voice and Internet provider. My blackberry wont turn on what so ever so i cant exactly do a OS upgrade i have done everything. how to solve blackberr bold 9900 app error? Was this answer. Error During Cryptacquirecontext For A New Key Applying the latest technologies in this area

This error occurred even when I changed. This is the XSS vulnerability we found when we scanned the web application with Netsparker: Let’s take a closer look at.

Currently I am trying to compile glib-2.32.3. I am using Red Hadt linux, 64bit (x86_64) machine. I am trying to compile glib-2.32.3 for 32bit. I did

Feb 10, 2008. checking build system type. i686-pc-linux-gnu checking host system type. i686- pc-linux-gnu checking target system type. i686-pc-linux-gnu checking for a BSD- compatible install. /usr/bin/install -c checking for -p flag to install. yes checking whether build environment is sane. yes checking for a.

I'm am new to both *nix and brew. I tried to install many things using Homebrew, but it keeps saying: configure: error: *** Working zlib library and headers not found.

There’s not much to it, but it’s enough to dive into the next section. Every.

checking for objdir.libs checking for ar. ar checking for ranlib. As it says in the title when trying./configure I'm getting configure: error: zlib not found.

MediaTomb is an open source (GPL) UPnP MediaServer with a nice web user interface, it allows you to stream your digital media through your home network and listen to.

2013年1月13日. 另外的错误提示一并贴一下出现configure: error: C compiler cannot create executables. 安装sudo apt-get install libc6-dev. 出现configure: error: configure: error: pcre-config not found. 安装sudo apt-get install libpcre3-dev 出现 configure: error: zlib-headers and/or libs where not found. 安装sudo apt-get.

Home > Not Found > Configure Error Zlib-headers And/or Libs Where Not Found Configure Error Zlib-headers And/or Libs Where Not Found. Contents.

Aug 22, 2013. You don't have the headers/libraries to build qemu. The easy way to solve this situation is doing: sudo apt-get –no-install-recommends -y build-dep qemu. Now, to solve that message: sudo apt-get install zlib1g-dev.

Jun 4, 2015. If you may get an error while installing or configuring package in your Linux system, configure: error: Zlib header (zlib.h) not found. Tor requires zlib to build. You may need to install a zlib development package. Install zlib-devel package using YUM command, # yum install zlib-devel -y. If you are working on.

A Practical Guide to Improving Web Accessibility – also add a link to where the original source can be found. A link allows users to view the content on the original site, which may have more controls, accessibility.

RECOMMENDED: Click here to fix Windows errors and improve system performance

News

Error C3262 Invalid Array Indexing

RECOMMENDED: If you have Windows errors then we strongly recommend that you download and run this (Windows) Repair Tool.

WASHINGTON, Feb. 28 – The State Department on Monday detailed an array of human rights abuses last year by the Iraqi government, including torture, rape and illegal detentions by police officers and functionaries of the interim.

Nov 18, 2009  · unable to use a 2D array. Visual Studio Languages , Windows Desktop Development > Visual C++. But I get an error error C3262: invalid array indexing:.

visual c++ – Multidimensional array C++.net CLI – Stack. – Error 1 error C3262: invalid array indexing: 1 dimension(s). How to insert an item into an array at a specific index? 2199. How do I empty an array in JavaScript?

Microsoft Windows – An invalid parameter was passed to the function. This error is. count and an array of MIB_IFSTACK_ROW structures for each interface stack entry. The relationship between the interfaces in the interface stack is that the interface with.

Error Zlib-headers And/or Libs Where Not Found While traditional economics assumes that people are rational actors, Thaler. Ibm 3362 Transport Error Proceedings of SPIE, 3362, 322–5. IBM Journal of Research and Development , 17, 525. [Bennett, 1988] Bennett, C.H. (1988). Notes on the History of Reversible Computation. IBM Journal of Research and Development, 32, 16–23. [Bennett. Systems – Possible Future High-Capacity Transport

I receive error message with two dimensional arrays in Windows Form Application. error C3262: invalid array indexing:. (array<double,

Error 1 error C3262: invalid array indexing: 1 dimension(s) specified for 2-dimensional ‘cli::array ^’ Error 2 error C2109: subscript requires array or pointer type.

Compiler Errors C3200 Through C3299. 11/17/2017 9 minutes to read Contributors. In this article. Compiler Error C3262: invalid array indexing: number dimension(s).

Error 1 error C3262: invalid array indexing: 1 dimension(s) specified for 2-dimensional ‘cli::array ^’ Error 2 error C2109: subscript requires array or pointer type.

The latest version of this topic can be found at Compiler Error C3262. invalid array indexing: '#' dimension(s) specified for '#'-dimensional 'array type'

Global arrays in cli/c++ – Software Development | DaniWeb –. System::Boolean helpdesk;; static array<String^>^ salka = gcnew array<String^ >(20);; /// </summary>. Unfortunatelly,when I am providing data to the array, I recive an error: Code: salka[i]=linia;. Error: error C3262: invalid array indexing: 0 dimension(s) specified for 1-dimensional 'cli::array<Type> ^'.

Ibm 3362 Transport Error Proceedings of SPIE, 3362, 322–5. IBM Journal of Research and Development , 17, 525. [Bennett, 1988] Bennett, C.H. (1988). Notes on the History of Reversible Computation. IBM Journal of Research and Development, 32, 16–23. [Bennett. Systems – Possible Future High-Capacity Transport Implementations. Paustian Transport Service is in the Local Trucking, Without Storage business. View competitors,

array< int,2>^ a = gcnew. Error 1 error C3262: invalid array indexing: 1 dimension(s). Use trhe following form of indexing. a[i, j] = 0; share | improve this.

Invalid memory accesses are one of the most. re-used buffer Generalizing from the above example, we say that an array is a qualifying array if every write to.

Feb 22, 2012. Solved: i DON'T UNDERSTAND this error : ERROR ARRAY INDEX IS INVALID FOR THIS ARRAY Do you can to help me. Thank you.

Jun 15, 2011. void MNumeric::ChangeArray(cli::array<int,2> ^arr, int mySize) { pin_ptr<int> p = &arr[0,0]; // pin pointer to first element in arr int* np = p; // pointer to the first element in arr UNumeric::ChangeArray((int**)np, mySize); }.

Nov 25, 2013. array<int,2>^ a = gcnew array<int,2>(5,5); for(int i=0; i<5; i++) { for(int j=0; j<5; j ++) { a[i][j] = 0; } }. The above code is giving me the following two errors: Error 1 error C3262: invalid array indexing: 1 dimension(s) specified for 2-dimensional ' cli::array ^'. Error 2 error C2109: subscript requires array or pointer.

Hp 4650 Error Message Unable To Store Job At Printer View and Download HP 4650dn manual online. Hewlett-Packard Color LaserJet Use. 4650dn Printer pdf manual download. Ibm 3362 Transport Error Proceedings of SPIE, 3362, 322–5. IBM Journal of Research and Development , 17, 525. [Bennett, 1988] Bennett, C.H. (1988). Notes on the History of Reversible Computation. IBM Journal of Research and Development, 32, 16–23. [Bennett.

RECOMMENDED: Click here to fix Windows errors and improve system performance

News

Ibm 3362 Transport Error

Implementing TLS with IBM Domino and IHS

RECOMMENDED: If you have Windows errors then we strongly recommend that you download and run this (Windows) Repair Tool.

Proceedings of SPIE, 3362, 322–5. IBM Journal of Research and Development , 17, 525. [Bennett, 1988] Bennett, C.H. (1988). Notes on the History of Reversible Computation. IBM Journal of Research and Development, 32, 16–23. [Bennett. Systems – Possible Future High-Capacity Transport Implementations.

Paustian Transport Service is in the Local Trucking, Without Storage business. View competitors, revenue, employees, website and phone number.

with IBM Watson Internet of Things cognitive capabilities to unlock new value for customers in utilities, industry and transport & infrastructure. Customers will benefit from ABB’s deep domain knowledge and extensive portfolio of digital.

Pinned topic connection problems with remote OG container. I keep getting an error, 2a882a88 ORBRas d com.ibm.rmi.transport.TCPTransportConnection.

“What information technology and the ubiquitious nature of it has allowed us to do is actually get very deep insight into individuals,” said Kevin Bishop, vice president of IBM’s ExperienceOne portfolio. “To do that, you need a lot of.

A Vulnerability is a state in a computing system (or set of systems) which either (a) allows an attacker to execute commands as another user, (b) allows an attacker.

Retrouvez toutes les discothèque Marseille et se retrouver dans les plus grandes soirées en discothèque à Marseille.

This tutorial teaches how to setup WebSphere MQ Secure. It is valid only for channels with a transport type. Error in the channel initiator log due to.

Nov 19, 2014. marily CDR1, CDR2, and MDR1, which transport fluconazole out. Pearson chi- square tests were performed using SPSS software (IBM, Ar-. CAS11-3362. ATL05. 8 (R). 0.125 (S). CAS12-3954. ATL10. 16 (R). 0.25 (I). CAS12-3992. ATL14. 8 (R). 0.125 (S) a SNP 1 is the A395T substitution (amino acid.

"Making distributed ledger technologies more interoperable is the latest example of IBM’s leadership driving the rapid advancement of blockchain. the U.K.Big Blue said it wants to speed up the "costly, laborious and error-prone".

BrowseActive Optical Cable Market Report with TOC @ Some of the advantages of active optical cable include its.

Slssqlmaint Failed Sqlstate Hy000 Error 50000 Error 500 Blackberry 9900 Canadian wireless voice and Internet provider. My blackberry wont turn on what so ever so i cant exactly do a OS upgrade i have done everything. how to solve blackberr bold 9900 app error? Was this answer. Error During Cryptacquirecontext For A New Key Applying the latest technologies in this area

specific classes of intrusions, such as IBM Tivoli Intrusion Manager for MQSeries products [11]. VoIP systems pose. media delivery protocols (MDP), e.g., the Real Time Transport Protocol (RTP). [3]. SCIDIVE proposes two critical. Some common SIP error messages are described in Table 1. Table 1: Sample SIP Error.

Automation can help create efficient, error- free, fatigue-free workforces that can handle an increasing level of complexity. IBM’s Watson can diagnose.

Blockchain – According to IBM and. human error and inadvertent delays.” Meanwhile,

RECOMMENDED: Click here to fix Windows errors and improve system performance

News

Prestashop Ajax Error Parseerror

How to use AJAX in PrestaShop admin page

RECOMMENDED: If you have Windows errors then we strongly recommend that you download and run this (Windows) Repair Tool.

Add to cart not working : parseerror – posted in Configuring and using PrestaShop: HiFirst of all I wanted to say, among all other sopping carts I have been trying in.

Error 500 Blackberry 9900 Canadian wireless voice and Internet provider. My blackberry wont turn on what so ever so i cant exactly do a OS upgrade i have done everything. how to solve blackberr bold 9900 app error? Was this answer. Error During Cryptacquirecontext For A New Key Applying the latest technologies in this area is the key to.

RXML parse error: Attribute ‘src’ cannot be empty | <emit format="jpeg. as well as a drug ledger and about $800 in cash in the false bottoms of a soft drink bottle and a container of Ajax underneath a sink. When they searched Orozco’s.

To už funguje, v modulu košíku stačí vypnout AJAX. Řešení jsem našel tady: http ://podpora.endora.cz/viewtopic.php?. hop#p12780. 2. Horší je, že pokud chci přidat jakékoliv nové zboží, hned vyskočí po sobě dvě chybová okna: Supplier ajax error: parsererror. Manufacturer ajax error: parsererror a nejde.

There are a two separate parts needed to get AJAX WordPress comments working, so lets explain those first. formurl, data: formdata, error: function(XMLHttpRequest, textStatus, errorThrown){ statusdiv.html(‘<p class="wdpajax-error".

Hi,Every time I add new product or category, this error notice is always shows "Manufacturer ajax error: parsererror" please help me

[TECHNICAL ERROR] ajaxProductManufacturers: parsererror. – [TECHNICAL ERROR] ajaxProductManufacturers: parsererror – posted in Ecommerce x PrestaShop [ARCHIVE BOARD]: hi all i got little problem with my presta – im using 1.5.

My website is working fine until this early week, whenever customers try to add a product, it will come out with this error; Impossible to add the product to the cart.

Erreur 500 PrestaShop : Comment la résoudre facilement ? – On la découvre en tombant sur un de ses messages en tapant l'URL de son site web PrestaShop sur son navigateur : HTTP 500 – Internal Server Error; 500 Error ; HTTP Error 500; Internal Server Error; HTTP 500 Internal Error; 500 Internal Server Error. erreur 500 PrestaShop. Qui n'a rencontré un jour cette erreur 500.

Error During Cryptacquirecontext For A New Key Applying the latest technologies in this area is the key to. for this new track, so. Important This API is deprecated. New and existing software should start using Cryptography Next Generation APIs. Microsoft may remove this API in future releases. The CryptAcquireCertificatePrivateKey function obtains the private key for a certificate. This function is used to

Prestashop Core Application V1.4; PSCFI-4099; Supplier ajax error: parseerror. "Supplier ajax error: parseerror". And the list of suppliers is not populated.

Youthful Buhera born Artwell Makumbe takes the Zimbabwe information. The site has new features such as sandbox, ajax browsing, theme management, market place, blogs, ad campaigns, video and musical sharing, multilingual with.

Error Creating View Eclipse Aug 18, 2017. SALT LAKE CITY — Glasses to protect your eyes during the total eclipse are a hot commodity in Utah these days, but if you were unable to find a pair there are still several ways you. Click here for instructions on making a pinhole projection box , and click here for instructions

Si por el contrario has llegado hasta aquí porque no puedes registrarte en una tienda debido a este error, contacta rápidamente con el administrador de la tienda, pues tiene un problema serio y no lo sabe. El problema es que el módulo de autentificación no redirige correctamente a donde debe redirigir, falla al usar Ajax.

Jan 05, 2016 · I have a website using Prestashop 1.4.7.3 (and cannot upgrade it for now) and have trouble since 2 days when I try to add a product in ajax cart, this is the error.

RECOMMENDED: Click here to fix Windows errors and improve system performance