News

Radiusd Error Loading Shared Libraries

Error while loading shared libraries: libpng14.so.14

RECOMMENDED: If you have Windows errors then we strongly recommend that you download and run this (Windows) Repair Tool.

Error 402 Bigpond Back to Small Appliances and Power Tools Repair FAQ Table of Contents. Basic Appliance Theory What is inside an appliance? There isn’t much rocket science in the. but it gives me the same error of : "You can only log in using your primary BigPond Broadband account If you can’t remember your primary account username

Serbia – error in Loading SAP im hassan am new to thisolve this site kindly help me to solve this issue SAPinst is getting started. Please be patient. starting gui server process: sapinstport: 21200. SAP Landscape Transformation ( LT) Scope.

Jun 16, 2010. I also got the same problem when I am compiling FreeRADIUS 2.1.8. error while loading shared libraries: libfreeradius-radius-2.1.9.so:.

He asks “I’m trying to do some web performance testing and I compiled weighttp and the libev libraries, which worked fine, but when I try to run the program it gives me the following error.” weighttp: error while loading shared libraries:.

3 days ago. error while loading shared libraries: libgconf-2.so.4: cannot open shared object file: No such file or directory #2134. Open. matthewkturner.

Error 401 Iis 6 Sql Server Agent Error 17052 SQL Server Event ID 17052: SQLServerAgent. The description for Event ID 17052 from. to generate a Full Dump in the event of SQL Server Agent. Orlando – The SQL Server team has already delivered new cmdlets to help you manage SQL Agent Jobs, SQL Error Logs, and Add & Remove

shared library – How do i resolve "missing module" error – Ask Ubuntu – Apr 22, 2017. etc/freeradius/3.0/mods-enabled/rest[1]: Failed to link to module. skype: error while loading shared libraries: libXss.so.1: cannot open shared.

I am currently running CentOS 6.5 64-bit. I am attempting to install a 32-bit application and I'm getting the error below during the application.

2.1.3 first start error. Hi I have installed the freeradius 2.1.3 from source, and and get this error, on first start: radiusd: error while loading shared libraries:.

error loading shared libraries – The mount command seg faults and I get a lot of garbled output while booting. I get the error "error while loading shared libraries" when I chroot to my fedora partition. Only programs compiled dynamically (gcc -shared) give a seg.

I have a simple test program that when I run I get:./hello: error while loading shared libraries: libaio.so.1: cannot open shared object file: No such file or.

Jul 17, 2016. nginx./nginx: error while loading shared libraries: libpcre.so.1: cannot open shared object file: No such file or directory. $. If you are getting.

One shot solution to fix 'error while loading shared libraries' error in Ubuntu. Works within a minute.

Cannot run radiusd – error loading shared libraries. Platform Suse 9.0 No error on compile. When I try: # /usr/local/sbin/radiusd I get: /usr/local/sbin/radiusd.

Feb 24, 2015. From the ldd command it looks like the binary is looking in /lib/x86_64-linux-gnu and not /usr/lib/x86_64-linux-gnu where you found the symlink.

this is an error i got when i run radius server in debugging mode radiusd -X. i checked a lot and i unable to. radiusd: error while loading shared libraries:.

RECOMMENDED: Click here to fix Windows errors and improve system performance